Target
Carbonic anhydrase 7
Ligand
BDBM50237192
Substrate
Meas. Tech.
ChEMBL_1660631 (CHEMBL4010243)
Ki
>50000±n/a nM
Citation
 Mishra, CBKumari, SAngeli, AMonti, SMBuonanno, MTiwari, MSupuran, CT Discovery of Benzenesulfonamides with Potent Human Carbonic Anhydrase Inhibitory and Effective Anticonvulsant Action: Design, Synthesis, and Pharmacological Assessment. J Med Chem 60:2456-2469 (2017)  
Target
Name:
Carbonic anhydrase 7
Synonyms:
CA-VII CAH7_HUMAN Carbonic anhydrase Carbonic anhydrase VII (CA VII)
Type:
Enzyme
Mol. Mass.:
29664.11
Organism:
Homo sapiens (Human)
Description:
Human cloned isozyme.
Residue:
264
  
Inhibitor
Name:
BDBM50237192
Synonyms:
CHEMBL4072947
Type:
Small organic molecule
Emp. Form.:
C19H24FN5O3S
Mol. Mass.:
421.489
SMILES:
NS(=O)(=O)c1ccc(NC(=O)NCCN2CCN(CC2)c2ccc(F)cc2)cc1
: