Target
Tyrosinase
Ligand
BDBM50237230
Substrate
Meas. Tech.
ChEMBL_1660839 (CHEMBL4010451)
IC50
5000±n/a nM
Citation
 Santi, MDPeralta, MAMendoza, CSCabrera, JLOrtega, MG Chemical and bioactivity of flavanones obtained from roots of Dalea pazensis Rusby. Bioorg Med Chem Lett 27:1789-1794 (2017)  
Target
Name:
Tyrosinase
Synonyms:
TYRO_MOUSE | Tyr
Type:
Protein
Mol. Mass.:
60600.74
Organism:
Mus musculus (Mouse)
Description:
Residue:
533
  
Inhibitor
Name:
BDBM50237230
Synonyms:
CHEMBL4101226
Type:
Small organic molecule
Emp. Form.:
C26H30O6
Mol. Mass.:
438.5128
SMILES:
[#6]-[#8]-c1cc(-[#8])c(cc1-[#6]-1-[#6]-[#6](=O)-c2c(-[#8])cc(-[#8])c(-[#6]\[#6]=[#6](\[#6])-[#6])c2-[#8]-1)C([#6])([#6])[#6]=[#6]
: