Target
Tyrosinase
Ligand
BDBM50031467
Substrate
Meas. Tech.
ChEMBL_1660839 (CHEMBL4010451)
IC50
2000000±n/a nM
Citation
 Santi, MDPeralta, MAMendoza, CSCabrera, JLOrtega, MG Chemical and bioactivity of flavanones obtained from roots of Dalea pazensis Rusby. Bioorg Med Chem Lett 27:1789-1794 (2017)  
Target
Name:
Tyrosinase
Synonyms:
TYRO_MOUSE | Tyr
Type:
Protein
Mol. Mass.:
60600.74
Organism:
Mus musculus (Mouse)
Description:
Residue:
533
  
Inhibitor
Name:
BDBM50031467
Synonyms:
5-HYDROXY-2-(HYDROXYMETHYL)-4H-PYRAN-4-ONE CHEMBL287556 US10857082, Kojic acid US9682910, kojic acid
Type:
Small organic molecule
Emp. Form.:
C6H6O4
Mol. Mass.:
142.1094
SMILES:
OCc1cc(=O)c(O)co1
: