Target
Tyrosinase
Ligand
BDBM50237231
Substrate
Meas. Tech.
ChEMBL_1660839 (CHEMBL4010451)
IC50
750±n/a nM
Citation
 Santi, MDPeralta, MAMendoza, CSCabrera, JLOrtega, MG Chemical and bioactivity of flavanones obtained from roots of Dalea pazensis Rusby. Bioorg Med Chem Lett 27:1789-1794 (2017)  
Target
Name:
Tyrosinase
Synonyms:
TYRO_MOUSE | Tyr
Type:
Protein
Mol. Mass.:
60600.74
Organism:
Mus musculus (Mouse)
Description:
Residue:
533
  
Inhibitor
Name:
BDBM50237231
Synonyms:
CHEMBL4063130
Type:
Small organic molecule
Emp. Form.:
C25H28O6
Mol. Mass.:
424.4862
SMILES:
[#6]\[#6](-[#6])=[#6]\[#6]-c1c(-[#8])cc2-[#8]-[#6](-[#6]-[#6](=O)-c2c1-[#8])-c1ccc(-[#8])c(-[#8])c1-[#6]\[#6]=[#6](\[#6])-[#6]
: