Target
Tyrosinase
Ligand
BDBM50237232
Substrate
Meas. Tech.
ChEMBL_1660839 (CHEMBL4010451)
IC50
1000±n/a nM
Citation
 Santi, MDPeralta, MAMendoza, CSCabrera, JLOrtega, MG Chemical and bioactivity of flavanones obtained from roots of Dalea pazensis Rusby. Bioorg Med Chem Lett 27:1789-1794 (2017)  
Target
Name:
Tyrosinase
Synonyms:
TYRO_MOUSE | Tyr
Type:
Protein
Mol. Mass.:
60600.74
Organism:
Mus musculus (Mouse)
Description:
Residue:
533
  
Inhibitor
Name:
BDBM50237232
Synonyms:
CHEMBL516671
Type:
Small organic molecule
Emp. Form.:
C25H28O6
Mol. Mass.:
424.4862
SMILES:
[#6]\[#6](-[#6])=[#6]\[#6]-c1c(-[#8])cc(-[#8])c2-[#6](=O)-[#6]-[#6](-[#8]-c12)-c1cc(c(-[#8])cc1-[#8])C([#6])([#6])[#6]=[#6]
: