Target
Cholinesterase
Ligand
BDBM50237539
Substrate
Meas. Tech.
ChEMBL_1662072 (CHEMBL4011753)
IC50
950±n/a nM
Citation
 Sang, ZPan, WWang, KMa, QYu, LYang, YBai, PLeng, CXu, QLi, XTan, ZLiu, W Design, synthesis and evaluation of novel ferulic acid-O-alkylamine derivatives as potential multifunctional agents for the treatment of Alzheimer's disease. Eur J Med Chem 130:379-392 (2017)  
Target
Name:
Cholinesterase
Synonyms:
BCHE CHLE_HORSE | Cholinesterase
Type:
Enzyme
Mol. Mass.:
65643.35
Organism:
Equus caballus (Horse)
Description:
P81908
Residue:
574
  
Inhibitor
Name:
BDBM50237539
Synonyms:
CHEMBL4059925
Type:
Small organic molecule
Emp. Form.:
C37H48N4O3
Mol. Mass.:
596.802
SMILES:
COc1cc(\C=C\C(=O)N2CCC(Cc3ccccc3)CC2)ccc1OCCCCCCN1CCN(CC1)c1ccccn1
: