Target
Acetylcholinesterase
Ligand
BDBM50237228
Substrate
Meas. Tech.
ChEMBL_1662071 (CHEMBL4011752)
IC50
8400±n/a nM
Citation
 Sang, ZPan, WWang, KMa, QYu, LYang, YBai, PLeng, CXu, QLi, XTan, ZLiu, W Design, synthesis and evaluation of novel ferulic acid-O-alkylamine derivatives as potential multifunctional agents for the treatment of Alzheimer's disease. Eur J Med Chem 130:379-392 (2017)  
Target
Name:
Acetylcholinesterase
Synonyms:
ACES_ELEEL Acetylcholinesterase (EeAChE) | ache
Type:
Enzyme
Mol. Mass.:
71812.79
Organism:
Electrophorus electricus (Electric eel)
Description:
Residue:
633
  
Inhibitor
Name:
BDBM50237228
Synonyms:
CHEMBL4102156
Type:
Small organic molecule
Emp. Form.:
C36H45N3O3
Mol. Mass.:
567.7608
SMILES:
COc1cc(\C=C\C(=O)N2CCC(Cc3ccccc3)CC2)ccc1OCCCN1CCN(Cc2ccccc2)CC1
: