Target
Acetylcholinesterase
Ligand
BDBM50237542
Substrate
Meas. Tech.
ChEMBL_1662076 (CHEMBL4011757)
IC50
58500±n/a nM
Citation
 Sang, ZPan, WWang, KMa, QYu, LYang, YBai, PLeng, CXu, QLi, XTan, ZLiu, W Design, synthesis and evaluation of novel ferulic acid-O-alkylamine derivatives as potential multifunctional agents for the treatment of Alzheimer's disease. Eur J Med Chem 130:379-392 (2017)  
Target
Name:
Acetylcholinesterase
Synonyms:
ACES_RAT Acetylcholinesterase and butyrylcholinesterase (AChE and BChE) Acetylcholinesterase, AChE | Ache
Type:
Enzyme
Mol. Mass.:
68193.62
Organism:
Rattus norvegicus (rat)
Description:
P37136
Residue:
614
  
Inhibitor
Name:
BDBM50237542
Synonyms:
CHEMBL4077421
Type:
Small organic molecule
Emp. Form.:
C36H46N4O3
Mol. Mass.:
582.7754
SMILES:
COc1cc(\C=C\C(=O)N2CCC(Cc3ccccc3)CC2)ccc1OCCCCCN1CCN(CC1)c1ccccn1
: