Target
Complement factor D
Ligand
BDBM203868
Substrate
Meas. Tech.
ChEBML_1663607
IC50
5800±n/a nM
Citation
 Lorthiois, EAnderson, KVulpetti, ARogel, OCumin, FOstermann, NSteinbacher, SMac Sweeney, ADelgado, OLiao, SMRandl, SRüdisser, SDussauge, SFettis, KKieffer, Lde Erkenez, AYang, LHartwieg, CArgikar, UALa Bonte, LRNewton, RKansara, VFlohr, SHommel, UJaffee, BMaibaum, J Discovery of Highly Potent and Selective Small-Molecule Reversible Factor D Inhibitors Demonstrating Alternative Complement Pathway Inhibition in Vivo. J Med Chem 60:5717-5735 (2017)  
Target
Name:
Complement factor D
Synonyms:
Adipsin CFAD_HUMAN DF Properdin factor D
Type:
Protein
Mol. Mass.:
27039.19
Organism:
Homo sapiens (Human)
Description:
P00746
Residue:
253
  
Inhibitor
Name:
BDBM203868
Synonyms:
(S)-N2-benzhydryl-N1-(1-methyl-1H-indol-3-yl)pyrrolidine-1,2-dicarboxamide (5)
Type:
Small organic molecule
Emp. Form.:
C28H28N4O2
Mol. Mass.:
452.5475
SMILES:
Cn1cc(NC(=O)N2CCC[C@H]2C(=O)NC(c2ccccc2)c2ccccc2)c2ccccc12
: