Target
Casein kinase I isoform delta
Ligand
BDBM274881
Substrate
Meas. Tech.
Kinase Assay
pH
7.4±n/a
Temperature
298.15±n/a K
IC50
0.300±n/a nM
Comments
extracted
Citation
 Velaparthi, UDarne, CPDodd, DSSampognaro, AJWittman, MDKumaravel, SMullick, DLiu, PRachamreddy, CR Substituted imidazoles as casein kinase 1 D/E inhibitors US Patent  US9556179 Publication Date 1/31/2017 
Target
Name:
Casein kinase I isoform delta
Synonyms:
CKI-delta CSNK1D Casein kinase I delta Casein kinase I isoform delta (CK1D) KC1D_HUMAN | casein kinases 1 delta (CK1 delta)
Type:
Enzyme
Mol. Mass.:
47356.76
Organism:
Homo sapiens (Human)
Description:
P48730
Residue:
415
  
Inhibitor
Name:
BDBM274881
Synonyms:
N-(6-(2-(4- Fluorophenyl)-5,6,7,8- tetrahydroimidazo [1,2-a]pyrazin-3- yl)imidazo[1,2-b]pyridazin- 2-yl)-3-(pyridin-3- yl)benzamide | US9556179, Compound 459
Type:
Small organic molecule
Emp. Form.:
C30H23FN8O
Mol. Mass.:
530.555
SMILES:
Fc1ccc(cc1)-c1nc2CNCCn2c1-c1ccc2nc(NC(=O)c3cccc(c3)-c3cccnc3)cn2n1
: