Target
Casein kinase I isoform delta
Ligand
BDBM274887
Substrate
Meas. Tech.
Kinase Assay
pH
7.4±n/a
Temperature
298.15±n/a K
IC50
0.600±n/a nM
Comments
extracted
Citation
 Velaparthi, UDarne, CPDodd, DSSampognaro, AJWittman, MDKumaravel, SMullick, DLiu, PRachamreddy, CR Substituted imidazoles as casein kinase 1 D/E inhibitors US Patent  US9556179 Publication Date 1/31/2017 
Target
Name:
Casein kinase I isoform delta
Synonyms:
CKI-delta CSNK1D Casein kinase I delta Casein kinase I isoform delta (CK1D) KC1D_HUMAN | casein kinases 1 delta (CK1 delta)
Type:
Enzyme
Mol. Mass.:
47356.76
Organism:
Homo sapiens (Human)
Description:
P48730
Residue:
415
  
Inhibitor
Name:
BDBM274887
Synonyms:
2-Fluoro-N-(6-(2-(4-fluorophenyl)-7-(3,3,3- trifluoro-2,2-dimethylpropanoyl)-5,6,7,8- tetrahydroimidazo[1,2-a]pyrazin-3- yl)imidazo[1,2-b]pyridazin-2- yl)isonicotinamide | US9556179, Compound 465
Type:
Small organic molecule
Emp. Form.:
C29H23F5N8O2
Mol. Mass.:
610.5373
SMILES:
CC(C)(C(=O)N1CCn2c(C1)nc(c2-c1ccc2nc(NC(=O)c3ccnc(F)c3)cn2n1)-c1ccc(F)cc1)C(F)(F)F
: