Target
Histone acetyltransferase p300
Ligand
BDBM84874
Substrate
Meas. Tech.
Enzymatic Activity Assay
Temperature
310.15±0 K
Kd
1.0e+2± 4e+1 nM
Citation
 Dal Piaz, FTosco, AEletto, DPiccinelli, ALMoltedo, OFranceschelli, SSbardella, GRemondelli, PRastrelli, LVesci, LPisano, CDe Tommasi, N The identification of a novel natural activator of p300 histone acetyltranferase provides new insights into the modulation mechanism of this enzyme. Chembiochem 11:818-27 (2010)  
Target
Name:
Histone acetyltransferase p300
Synonyms:
EP300 HIF1A/p300/CREB-binding protein P300
Type:
Protein
Mol. Mass.:
264223.04
Organism:
Homo sapiens (Human)
Description:
Q09472
Residue:
2414
  
Inhibitor
Name:
BDBM84874
Synonyms:
Guttiferone A, 3
Type:
Small organic molecule
Emp. Form.:
C37H48O6
Mol. Mass.:
588.7734
SMILES:
[#6]\[#6](-[#6])=[#6]\[#6]-[#6@H]1-[#6][C@@]2([#6]\[#6]=[#6](\[#6])-[#6])[#6](=O)-[#6](-[#6](=O)-c3ccc(-[#8])c(-[#8])c3)-[#6](=O)[C@]([#6]\[#6]=[#6](\[#6])-[#6])([#6]2=O)[C@]1([#6])[#6]-[#6]=[#6](-[#6])-[#6]
: