Target
Histone acetyltransferase p300
Ligand
BDBM84875
Substrate
Meas. Tech.
Enzymatic Activity Assay
Temperature
310.15±0 K
Kd
3.9e+2± 8e+1 nM
Citation
 Dal Piaz, FTosco, AEletto, DPiccinelli, ALMoltedo, OFranceschelli, SSbardella, GRemondelli, PRastrelli, LVesci, LPisano, CDe Tommasi, N The identification of a novel natural activator of p300 histone acetyltranferase provides new insights into the modulation mechanism of this enzyme. Chembiochem 11:818-27 (2010)  
Target
Name:
Histone acetyltransferase p300
Synonyms:
EP300 HIF1A/p300/CREB-binding protein P300
Type:
Protein
Mol. Mass.:
264223.04
Organism:
Homo sapiens (Human)
Description:
Q09472
Residue:
2414
  
Inhibitor
Name:
BDBM84875
Synonyms:
Guttiferone E, 4
Type:
Small organic molecule
Emp. Form.:
C43H58O6
Mol. Mass.:
670.917
SMILES:
[#6]\[#6](-[#6])=[#6]\[#6]-[#6](-[#6]-[#6](-[#6]=[#6](-[#6])-[#6])[C@]12[#6]-[#6@H](-[#6]\[#6]=[#6](\[#6])-[#6])C([#6])([#6])[C@]([#6]\[#6]=[#6](\[#6])-[#6])([#6](=O)-[#6](-[#6](=O)-c3ccc(-[#8])c(-[#8])c3)-[#6]1=O)[#6]2=O)-[#6](-[#6])=[#6]
: