Target
Non-receptor tyrosine-protein kinase TYK2
Ligand
BDBM198225
Substrate
Meas. Tech.
Enzyme Assay
Temperature
298.15±n/a K
IC50
630±n/a nM
Comments
extracted
Citation
 Hayashi, KWatanabe, TToyama, KKamon, JMinami, MUni, MNasu, M Substituted pyrrolo[3′,2′:5,6]pyrido[4,3-d]pyrimidines and JAK inhibitors comprising the same US Patent  US9556187 Publication Date 1/31/2017 
Target
Name:
Non-receptor tyrosine-protein kinase TYK2
Synonyms:
Non-receptor tyrosine-protein kinase TYK2 (TYK2) TYK2_HUMAN | Tyrosine-protein kinase TYK2
Type:
Protein
Mol. Mass.:
133666.03
Organism:
Homo sapiens (Human)
Description:
P29597
Residue:
1187
  
Inhibitor
Name:
BDBM198225
Synonyms:
US9216999, 33 | US9556187, Example 33
Type:
Small organic molecule
Emp. Form.:
C20H19F3N6
Mol. Mass.:
400.4003
SMILES:
FC(F)(F)c1ccc(CN2CCC(CC2)c2nnn3cnc4[nH]ccc4c23)cc1
: