Target
Tyrosine-protein kinase JAK2
Ligand
BDBM198433
Substrate
Meas. Tech.
Enzyme Assay
Temperature
298.15±n/a K
IC50
130±n/a nM
Comments
extracted
Citation
 Hayashi, KWatanabe, TToyama, KKamon, JMinami, MUni, MNasu, M Substituted pyrrolo[3′,2′:5,6]pyrido[4,3-d]pyrimidines and JAK inhibitors comprising the same US Patent  US9556187 Publication Date 1/31/2017 
Target
Name:
Tyrosine-protein kinase JAK2
Synonyms:
JAK-2 JAK2_HUMAN Janus kinase 2 (JAK2) | Janus kinase 2 (a protein tyrosine kinase)
Type:
Protein
Mol. Mass.:
130684.68
Organism:
Homo sapiens (Human)
Description:
O60674
Residue:
1132
  
Inhibitor
Name:
BDBM198433
Synonyms:
US9216999, 230 | US9556187, Example 230
Type:
Small organic molecule
Emp. Form.:
C21H19N7
Mol. Mass.:
369.4225
SMILES:
N#C\C(=C/N1CCC(CC1)c1nnn2cnc3[nH]ccc3c12)c1ccccc1
: