Target
Non-receptor tyrosine-protein kinase TYK2
Ligand
BDBM198656
Substrate
Meas. Tech.
Enzyme Assay
Temperature
298.15±n/a K
IC50
52.0±n/a nM
Comments
extracted
Citation
 Hayashi, KWatanabe, TToyama, KKamon, JMinami, MUni, MNasu, M Substituted pyrrolo[3′,2′:5,6]pyrido[4,3-d]pyrimidines and JAK inhibitors comprising the same US Patent  US9556187 Publication Date 1/31/2017 
Target
Name:
Non-receptor tyrosine-protein kinase TYK2
Synonyms:
Non-receptor tyrosine-protein kinase TYK2 (TYK2) TYK2_HUMAN | Tyrosine-protein kinase TYK2
Type:
Protein
Mol. Mass.:
133666.03
Organism:
Homo sapiens (Human)
Description:
P29597
Residue:
1187
  
Inhibitor
Name:
BDBM198656
Synonyms:
US9216999, 445 | US9556187, Example 445
Type:
Small organic molecule
Emp. Form.:
C17H19N5O
Mol. Mass.:
309.3657
SMILES:
OC12CC3CC(C1)CC(C3)(C2)c1nnn2cnc3[nH]ccc3c12
: