Target
Tyrosine-protein kinase JAK3
Ligand
BDBM198219
Substrate
Meas. Tech.
Enzyme Assay
Temperature
298.15±n/a K
IC50
42.0±n/a nM
Comments
extracted
Citation
 Hayashi, KWatanabe, TToyama, KKamon, JMinami, MUni, MNasu, M Substituted pyrrolo[3′,2′:5,6]pyrido[4,3-d]pyrimidines and JAK inhibitors comprising the same US Patent  US9556187 Publication Date 1/31/2017 
Target
Name:
Tyrosine-protein kinase JAK3
Synonyms:
JAK-3 JAK3_HUMAN Janus kinase 3 (JAK3) L-JAK | Leukocyte janus kinase
Type:
Protein
Mol. Mass.:
125111.08
Organism:
Homo sapiens (Human)
Description:
P52333
Residue:
1124
  
Inhibitor
Name:
BDBM198219
Synonyms:
US9216999, 27 | US9556187, Example 27
Type:
Small organic molecule
Emp. Form.:
C12H14N6
Mol. Mass.:
242.2798
SMILES:
C1CC(CCN1)c1nnn2cnc3[nH]ccc3c12
: