Target
Alpha-glucosidase MAL12
Ligand
BDBM84969
Substrate
Meas. Tech.
Inhibition Assay
Ki
4.6e+3± 3e+2 nM
IC50
1.43e+4± 2e+2 nM
Citation
 Kim, JYLee, JWKim, YSLee, YRyu, YBKim, SRyu, HWCurtis-Long, MJLee, KWLee, WSPark, KH A novel competitive class of α-glucosidase inhibitors: (E)-1-phenyl-3-(4-styrylphenyl)urea derivatives. Chembiochem 11:2125-31 (2010)  
Target
Name:
Alpha-glucosidase MAL12
Synonyms:
α-Glucosidase MAL12_YEAST Maltase | alpha-Glucosidase (α-Glucosidase)
Type:
Protein
Mol. Mass.:
68084.32
Organism:
Saccharomyces cerevisiae
Description:
P53341
Residue:
584
  
Inhibitor
Name:
BDBM84969
Synonyms:
Urea derivative, 13
Type:
Small organic molecule
Emp. Form.:
C21H17ClN2O3
Mol. Mass.:
380.824
SMILES:
Oc1ccc(\C=C\c2ccc(NC(=O)Nc3ccc(Cl)cc3)cc2)cc1O
: