Target
Alpha-glucosidase MAL12
Ligand
BDBM84970
Substrate
Meas. Tech.
Inhibition Assay
Ki
1.70e+4± 1.3e+3 nM
IC50
2.91e+4± 3e+2 nM
Citation
 Kim, JYLee, JWKim, YSLee, YRyu, YBKim, SRyu, HWCurtis-Long, MJLee, KWLee, WSPark, KH A novel competitive class of α-glucosidase inhibitors: (E)-1-phenyl-3-(4-styrylphenyl)urea derivatives. Chembiochem 11:2125-31 (2010)  
Target
Name:
Alpha-glucosidase MAL12
Synonyms:
α-Glucosidase MAL12_YEAST Maltase | alpha-Glucosidase (α-Glucosidase)
Type:
Protein
Mol. Mass.:
68084.32
Organism:
Saccharomyces cerevisiae
Description:
P53341
Residue:
584
  
Inhibitor
Name:
BDBM84970
Synonyms:
Urea derivative, 14
Type:
Small organic molecule
Emp. Form.:
C21H18N2O2
Mol. Mass.:
330.3798
SMILES:
Oc1ccc(\C=C\c2ccc(NC(=O)Nc3ccccc3)cc2)cc1
: