Target
Alpha-glucosidase MAL12
Ligand
BDBM84971
Substrate
Meas. Tech.
Inhibition Assay
IC50
6.01e+4± 1.5e+3 nM
Citation
 Kim, JYLee, JWKim, YSLee, YRyu, YBKim, SRyu, HWCurtis-Long, MJLee, KWLee, WSPark, KH A novel competitive class of α-glucosidase inhibitors: (E)-1-phenyl-3-(4-styrylphenyl)urea derivatives. Chembiochem 11:2125-31 (2010)  
Target
Name:
Alpha-glucosidase MAL12
Synonyms:
α-Glucosidase MAL12_YEAST Maltase | alpha-Glucosidase (α-Glucosidase)
Type:
Protein
Mol. Mass.:
68084.32
Organism:
Saccharomyces cerevisiae
Description:
P53341
Residue:
584
  
Inhibitor
Name:
BDBM84971
Synonyms:
Urea derivative, 15
Type:
Small organic molecule
Emp. Form.:
C22H20N2O3
Mol. Mass.:
360.4058
SMILES:
COc1ccc(NC(=O)Nc2ccc(\C=C\c3ccc(O)cc3)cc2)cc1
: