Target
Substance-K receptor
Ligand
BDBM50000041
Substrate
Ki
>10000±n/a nM
Comments
PDSP_574
Citation
 Sarau, HMGriswold, DEPotts, WFoley, JJSchmidt, DBWebb, EFMartin, LDBrawner, MEElshourbagy, NAMedhurst, ADGiardina, GAHay, DW Nonpeptide tachykinin receptor antagonists: I. Pharmacological and pharmacokinetic characterization of SB 223412, a novel, potent and selective neurokinin-3 receptor antagonist. J Pharmacol Exp Ther 281:1303-11 (1997) Target
Name:
Substance-K receptor
Synonyms:
NK-2 receptor NK2R NKNAR Neurokinin A receptor Neurokinin-2 (NK-2) SKR TACR2 Tachykinin receptor 2 (NK2) | hnk-3
Type:
Protein
Mol. Mass.:
44455.78
Organism:
Homo sapiens (Human)
Description:
P21452
Residue:
398
  
Inhibitor
Name:
BDBM50000041
Synonyms:
(+) (2-Methoxy-benzyl)-(2-phenyl-piperidin-3-yl)-amine (+/-)(2-Methoxy-benzyl)-(2-phenyl-piperidin-3-yl)-amine (-)-(2-Methoxy-benzyl)-(2-phenyl-piperidin-3-yl)-amine (2-Methoxy-benzyl)-((2S,3S)-2-phenyl-piperidin-3-yl)-amine (2S,3S)-3-(2-Methoxy-benzyloxy)-2-phenyl-piperidine CHEMBL2114310 CP 99994 Tritiated-(2-Methoxy-benzyl)-(2-phenyl-piperidin-3-yl)-amine
Type:
Small organic molecule
Emp. Form.:
C19H24N2O
Mol. Mass.:
296.4067
SMILES:
COc1ccccc1CN[C@H]1CCCN[C@H]1c1ccccc1
: