Target
Galanin receptor type 1
Ligand
BDBM85172
Substrate
Ki
3±n/a nM
Comments
PDSP_853
Citation
 Smith, KEForray, CWalker, MWJones, KATamm, JABard, JBranchek, TALinemeyer, DLGerald, C Expression cloning of a rat hypothalamic galanin receptor coupled to phosphoinositide turnover. J Biol Chem 272:24612-6 (1997)  
Target
Name:
Galanin receptor type 1
Synonyms:
GALR1_RAT Galanin receptor type 1 Galnr1 | Galr1
Type:
Enzyme Catalytic Domain
Mol. Mass.:
38883.91
Organism:
RAT
Description:
Galanin R1 GALR1 RAT::Q62805
Residue:
346
  
Inhibitor
Name:
BDBM85172
Synonyms:
CAS_112747-70-3 | Galanin (1-15)
Type:
Small organic molecule
Emp. Form.:
C72H105N19O20
Mol. Mass.:
1556.7194
SMILES:
CC(C)C[C@H](NC(=O)[C@H](CC(C)C)NC(=O)[C@H](Cc1ccc(O)cc1)NC(=O)CNC(=O)[C@H](C)NC(=O)[C@H](CO)NC(=O)[C@H](CC(N)=O)NC(=O)[C@H](CC(C)C)NC(=O)[C@@H](NC(=O)[C@H](Cc1c[nH]c2ccccc12)NC(=O)CN)[C@@H](C)O)C(=O)NCC(=O)N1CCC[C@H]1C(=O)N[C@@H](Cc1cnc[nH]1)C(=O)N[C@@H](C)C(O)=O
: