Target
5-hydroxytryptamine receptor 1D
Ligand
BDBM85195
Substrate
Ki
575±n/a nM
Comments
PDSP_1150
Citation
 Phebus, LAJohnson, KWZgombick, JMGilbert, PJVan Belle, KMancuso, VNelson, DLCalligaro, DOKiefer, ADBranchek, TAFlaugh, ME Characterization of LY344864 as a pharmacological tool to study 5-HT1F receptors: binding affinities, brain penetration and activity in the neurogenic dural inflammation model of migraine. Life Sci 61:2117-26 (1997)  
Target
Name:
5-hydroxytryptamine receptor 1D
Synonyms:
5-HT-1D 5-HT1D 5HT1D_HUMAN HTR1DA Serotonin (5-HT) receptor | Serotonin Receptor 1D
Type:
G Protein-Coupled Receptor (GPCR)
Mol. Mass.:
41920.63
Organism:
Homo sapiens (Human)
Description:
Receptor binding assays were performed using human clone stably expressed in CHO cells.
Residue:
377
  
Inhibitor
Name:
BDBM85195
Synonyms:
CAS_5311097 NSC_5311097
Type:
Small organic molecule
Emp. Form.:
C21H22FN3O
Mol. Mass.:
351.4173
SMILES:
CN(C)C1CCc2[nH]c3ccc(NC(=O)c4ccc(F)cc4)cc3c2C1
: