Target
5-hydroxytryptamine receptor 7
Ligand
BDBM85195
Substrate
Ki
4851±n/a nM
Comments
PDSP_1150
Citation
 Phebus, LAJohnson, KWZgombick, JMGilbert, PJVan Belle, KMancuso, VNelson, DLCalligaro, DOKiefer, ADBranchek, TAFlaugh, ME Characterization of LY344864 as a pharmacological tool to study 5-HT1F receptors: binding affinities, brain penetration and activity in the neurogenic dural inflammation model of migraine. Life Sci 61:2117-26 (1997)  
Target
Name:
5-hydroxytryptamine receptor 7
Synonyms:
5-HT-7 5-HT7 5-HT7S 5HT7 HTR7 | Serotonin receptor 7
Type:
G Protein-Coupled Receptor (GPCR)
Mol. Mass.:
53573.08
Organism:
Homo sapiens (Human)
Description:
P34969
Residue:
479
  
Inhibitor
Name:
BDBM85195
Synonyms:
CAS_5311097 NSC_5311097
Type:
Small organic molecule
Emp. Form.:
C21H22FN3O
Mol. Mass.:
351.4173
SMILES:
CN(C)C1CCc2[nH]c3ccc(NC(=O)c4ccc(F)cc4)cc3c2C1
: