Target
Alpha-1A adrenergic receptor
Ligand
BDBM85195
Substrate
Ki
5060±n/a nM
Comments
PDSP_1150
Citation
 Phebus, LAJohnson, KWZgombick, JMGilbert, PJVan Belle, KMancuso, VNelson, DLCalligaro, DOKiefer, ADBranchek, TAFlaugh, ME Characterization of LY344864 as a pharmacological tool to study 5-HT1F receptors: binding affinities, brain penetration and activity in the neurogenic dural inflammation model of migraine. Life Sci 61:2117-26 (1997)  
Target
Name:
Alpha-1A adrenergic receptor
Synonyms:
ADA1A_RAT Adra1c Alpha-1A adrenoceptor Alpha-1C adrenergic receptor | adrenergic Alpha1A
Type:
Protein
Mol. Mass.:
51620.15
Organism:
Rattus norvegicus (Rat)
Description:
P43140
Residue:
466
  
Inhibitor
Name:
BDBM85195
Synonyms:
CAS_5311097 NSC_5311097
Type:
Small organic molecule
Emp. Form.:
C21H22FN3O
Mol. Mass.:
351.4173
SMILES:
CN(C)C1CCc2[nH]c3ccc(NC(=O)c4ccc(F)cc4)cc3c2C1
: