Target
Adenosine receptor A1
Ligand
BDBM85208
Substrate
Ki
4±n/a nM
Comments
PDSP_2624
Citation
 Camaioni, EDi Francesco, EVittori, SVolpini, RCristalli, G Adenosine receptor agonists: synthesis and biological evaluation of the diastereoisomers of 2-(3-hydroxy-3-phenyl-1-propyn-1-yl)NECA. Bioorg Med Chem 5:2267-75 (1997)  
Target
Name:
Adenosine receptor A1
Synonyms:
AA1R_RAT ADENOSINE A1 high Adenosine A1 receptor (A1) Adenosine receptors A1 | Adora1
Type:
Protein
Mol. Mass.:
36704.13
Organism:
Rattus norvegicus (rat)
Description:
Residue:
326
  
Inhibitor
Name:
BDBM85208
Synonyms:
S-PHPNECA
Type:
Small organic molecule
Emp. Form.:
C21H22N6O5
Mol. Mass.:
438.4366
SMILES:
CCNC(=O)[C@@H]1OC([C@H](O)[C@@H]1O)n1cnc2c(N)nc(nc12)C#CC(O)c1ccccc1
: