Target
D(2) dopamine receptor
Ligand
BDBM78576
Substrate
Ki
0.12±n/a nM
Comments
PDSP_2606
Citation
 Seeman, PTallerico, T Antipsychotic drugs which elicit little or no parkinsonism bind more loosely than dopamine to brain D2 receptors, yet occupy high levels of these receptors. Mol Psychiatry 3:123-34 (1998)  
Target
Name:
D(2) dopamine receptor
Synonyms:
D(2) dopamine receptor DOPAMINE D2 Long DRD2 Dopamine D2 receptor Dopamine D2 receptor (D2R) Dopamine2-like | d2
Type:
Cell-surface receptors
Mol. Mass.:
50647.10
Organism:
Homo sapiens (Human)
Description:
P14416
Residue:
443
  
Inhibitor
Name:
BDBM78576
Synonyms:
CIS-THIOTHIXENE SMR000058396 cid_941651 | med.21724, Compound Thiothixene
Type:
Small organic molecule
Emp. Form.:
C23H29N3O2S2
Mol. Mass.:
443.625
SMILES:
CN(C)S(=O)(=O)c1ccc2Sc3ccccc3\C(=C\CCN3CCN(C)CC3)c2c1
: