Target
D(4) dopamine receptor
Ligand
BDBM85223
Substrate
Ki
0.09±n/a nM
Comments
PDSP_2604
Citation
 Seeman, PTallerico, T Antipsychotic drugs which elicit little or no parkinsonism bind more loosely than dopamine to brain D2 receptors, yet occupy high levels of these receptors. Mol Psychiatry 3:123-34 (1998)  
Target
Name:
D(4) dopamine receptor
Synonyms:
D(2C) dopamine receptor DOPAMINE D4.2 DRD4 Dopamine D4 receptor
Type:
Enzyme
Mol. Mass.:
48373.19
Organism:
Homo sapiens (Human)
Description:
P21917
Residue:
419
  
Inhibitor
Name:
BDBM85223
Synonyms:
CAS_115368 Perospirone
Type:
Small organic molecule
Emp. Form.:
C23H30N4O2S
Mol. Mass.:
426.575
SMILES:
O=C1C2CCCCC2C(=O)N1CCCCN1CCN(CC1)c1nsc2ccccc12
: