Target
5-hydroxytryptamine receptor 1A
Ligand
BDBM50050098
Substrate
Ki
>10000±n/a nM
Comments
PDSP_1229
Citation
 Toll, LBerzetei-Gurske, IPPolgar, WEBrandt, SRAdapa, IDRodriguez, LSchwartz, RWHaggart, DO'Brien, AWhite, AKennedy, JMCraymer, KFarrington, LAuh, JS Standard binding and functional assays related to medications development division testing for potential cocaine and opiate narcotic treatment medications. NIDA Res Monogr 178:440-66 (1998) Target
Name:
5-hydroxytryptamine receptor 1A
Synonyms:
5-HT-1A 5-hydroxytryptamine receptor 1A (5-HT-1A) ADRB2RL1 Dopamine D2 receptor and serotonin 1a receptor HTR1A | Serotonin receptor 1A
Type:
Mol. Mass.:
46122.49
Organism:
Homo sapiens (Human)
Description:
Residue:
422
  
Inhibitor
Name:
BDBM50050098
Synonyms:
(S)-Phenyl-(S)-piperidin-2-yl-acetic acid methyl ester; hydrochloride METHYLPHENIDATE
Type:
Small organic molecule
Emp. Form.:
C14H19NO2
Mol. Mass.:
233.3062
SMILES:
COC(=O)[C@H]([C@@H]1CCCCN1)c1ccccc1
: