Target
Delta-type opioid receptor
Ligand
BDBM50021325
Substrate
Ki
46.7±n/a nM
Comments
PDSP_669
Citation
 Toll, LBerzetei-Gurske, IPPolgar, WEBrandt, SRAdapa, IDRodriguez, LSchwartz, RWHaggart, DO'Brien, AWhite, AKennedy, JMCraymer, KFarrington, LAuh, JS Standard binding and functional assays related to medications development division testing for potential cocaine and opiate narcotic treatment medications. NIDA Res Monogr 178:440-66 (1998) Target
Name:
Delta-type opioid receptor
Synonyms:
Delta opioid receptor OPIATE Delta OPRD_PIG
Type:
Enzyme Catalytic Domain
Mol. Mass.:
25736.90
Organism:
GUINEA PIG
Description:
OPIATE Delta OPRD1 GUINEA PIG::P79291
Residue:
228
  
Inhibitor
Name:
BDBM50021325
Synonyms:
4-methyl-(1S,5R,13R,14S)-12-oxa-4-azapentacyclo[9.6.1.01,13.05,17.07,18]octadeca-7(18),8,10-triene-10,14-diol(DHM) DIHYDROMORPHINE
Type:
Small organic molecule
Emp. Form.:
C17H21NO3
Mol. Mass.:
287.3535
SMILES:
CN1CC[C@@]23[C@H]4Oc5c2c(C[C@@H]1C3CC[C@@H]4O)ccc5O
: