Target
Endothelin-1 receptor
Ligand
BDBM50041617
Substrate
Ki
0.4±n/a nM
Comments
PDSP_1665
Citation
 Ohlstein, EHNambi, PHay, DWGellai, MBrooks, DPLuengo, JXiang, JNElliott, JD Nonpeptide endothelin receptor antagonists. XI. Pharmacological characterization of SB 234551, a high-affinity and selective nonpeptide ETA receptor antagonist. J Pharmacol Exp Ther 286:650-6 (1998) Target
Name:
Endothelin-1 receptor
Synonyms:
EDNRA ET-A ETA-R Endothelin receptor type A hET-AR
Type:
Enzyme Catalytic Domain
Mol. Mass.:
48736.88
Organism:
Homo sapiens (Human)
Description:
P25101
Residue:
427
  
Inhibitor
Name:
BDBM50041617
Synonyms:
(1S,2R,3S)-1-Benzo[1,3]dioxol-5-yl-3-(2-carboxymethoxy-4-methoxy-phenyl)-5-propoxy-indan-2-carboxylic acid CHEMBL8823 SB-209670
Type:
Small organic molecule
Emp. Form.:
C29H28O9
Mol. Mass.:
520.5272
SMILES:
CCCOc1ccc2[C@@H]([C@H]([C@@H](c2c1)c1ccc(OC)cc1OCC(O)=O)C(O)=O)c1ccc2OCOc2c1
: