Target
Metabotropic glutamate receptor 2
Ligand
BDBM85379
Substrate
Ki
376±n/a nM
Comments
PDSP_3323
Citation
 Mutel, VAdam, GChaboz, SKemp, JAKlingelschmidt, AMesser, JWichmann, JWoltering, TRichards, JG Characterization of (2S,2'R,3'R)-2-(2',3'-[3H]-dicarboxycyclopropyl)glycine binding in rat brain. J Neurochem 71:2558-64 (1998)  
Target
Name:
Metabotropic glutamate receptor 2
Synonyms:
GPRC1B GRM2_HUMAN Metabotropic glutamate receptor mGlu2 | metabotropic glutamate 2
Type:
Enzyme
Mol. Mass.:
95584.88
Organism:
Homo sapiens (Human)
Description:
Q14416
Residue:
872
  
Inhibitor
Name:
BDBM85379
Synonyms:
CAS_5311079 NSC_5311079
Type:
Small organic molecule
Emp. Form.:
C7H13NO4
Mol. Mass.:
175.1824
SMILES:
CCC(N)(CCC(O)=O)C(O)=O
: