Target
5-hydroxytryptamine receptor 2C
Ligand
BDBM50003359
Substrate
Ki
39.81±n/a nM
Comments
PDSP_3206
Citation
 Watson, JBrough, SColdwell, MCGager, THo, MHunter, AJJerman, JMiddlemiss, DNRiley, GJBrown, AM Functional effects of the muscarinic receptor agonist, xanomeline, at 5-HT1 and 5-HT2 receptors. Br J Pharmacol 125:1413-20 (1998)  
Target
Name:
5-hydroxytryptamine receptor 2C
Synonyms:
5-HT-1C 5-HT1C 5-HT2C-INI 5-HTR2C 5-hydroxytryptamine receptor 2C (5-HT-2C) 5HT-1C HTR1C Serotonin (5-HT3) receptor Serotonin Receptor 2C
Type:
G Protein-Coupled Receptor (GPCR)
Mol. Mass.:
51836.79
Organism:
Homo sapiens (Human)
Description:
P28335
Residue:
458
  
Inhibitor
Name:
BDBM50003359
Synonyms:
5-(4-Hexyloxy-[1,2,5]thiadiazol-3-yl)-1-methyl-1,2,3,6-tetrahydro-pyridine; oxalic acid CHEMBL21536 LY 246708 | Xanomeline
Type:
Small organic molecule
Emp. Form.:
C14H23N3OS
Mol. Mass.:
281.417
SMILES:
CCCCCCOc1nsnc1C1=CCCN(C)C1
: