Target
Endothelin-1 receptor
Ligand
BDBM50143784
Substrate
Ki
0.03±n/a nM
Comments
PDSP_999
Citation
 Nishikibe, MOhta, HOkada, MIshikawa, KHayama, TFukuroda, TNoguchi, KSaito, MKanoh, TOzaki, SKamei, THara, KWilliam, DKivlighn, SKrause, SGabel, RZingaro, GNolan, NO'Brien, JClayton, FLynch, JPettibone, DSiegl, P Pharmacological properties of J-104132 (L-753,037), a potent, orally active, mixed ETA/ETB endothelin receptor antagonist. J Pharmacol Exp Ther 289:1262-70 (1999) Target
Name:
Endothelin-1 receptor
Synonyms:
EDNRA ET-A ETA-R Endothelin receptor type A hET-AR
Type:
Enzyme Catalytic Domain
Mol. Mass.:
48736.88
Organism:
Homo sapiens (Human)
Description:
P25101
Residue:
427
  
Inhibitor
Name:
BDBM50143784
Synonyms:
(5S,6R,7R)-5-Benzo[1,3]dioxol-5-yl-2-butyl-7-[2-((S)-2-carboxy-propyl)-4-methoxy-phenyl]-6,7-dihydro-5H-[1]pyrindine-6-carboxylic acid J-104132
Type:
Small organic molecule
Emp. Form.:
C31H33NO7
Mol. Mass.:
531.5962
SMILES:
CCCCc1ccc2[C@@H]([C@H]([C@@H](c2n1)c1ccc(OC)cc1C[C@H](C)C(O)=O)C(O)=O)c1ccc2OCOc2c1
: