Target
Prostaglandin F2-alpha receptor
Ligand
BDBM50150899
Substrate
Ki
555±n/a nM
Comments
PDSP_4304
Citation
 Abramovitz, MAdam, MBoie, YCarrière, MDenis, DGodbout, CLamontagne, SRochette, CSawyer, NTremblay, NMBelley, MGallant, MDufresne, CGareau, YRuel, RJuteau, HLabelle, MOuimet, NMetters, KM The utilization of recombinant prostanoid receptors to determine the affinities and selectivities of prostaglandins and related analogs. Biochim Biophys Acta 1483:285-93 (2000)  
Target
Name:
Prostaglandin F2-alpha receptor
Synonyms:
PF2R_HUMAN PGF2 alpha receptor PTGFR Prostanoid FP receptor
Type:
Enzyme
Mol. Mass.:
40072.29
Organism:
Homo sapiens (Human)
Description:
P43088
Residue:
359
  
Inhibitor
Name:
BDBM50150899
Synonyms:
(E)-7-[(1R,2R,3R,5S)-3,5-Dihydroxy-2-((R)-3-hydroxy-5-phenyl-pentyl)-cyclopentyl]-hept-5-enoic acid isopropyl ester LATANOPROST (PHXA41) | Latanoprost (Isopropyl Ester)
Type:
Small organic molecule
Emp. Form.:
C26H40O5
Mol. Mass.:
432.5928
SMILES:
CC(C)OC(=O)CCC\C=C\C[C@H]1[C@@H](O)C[C@@H](O)[C@@H]1CC[C@@H](O)CCc1ccccc1
: