Target
Macrophage colony-stimulating factor 1 receptor
Ligand
BDBM276743
Substrate
Meas. Tech.
c-Fms Enzyme Assay
pH
7±n/a
Temperature
298.15±n/a K
IC50
11.0±n/a nM
Comments
extracted
Citation
 Chen, JDonahue, MLim, HLin, RSalter, RWu, JGong, Y Substituted pyridine derivatives useful as c-fms kinase inhibitors US Patent  US10071991 Publication Date 9/11/2018 
Target
Name:
Macrophage colony-stimulating factor 1 receptor
Synonyms:
CD_antigen: CD115 CSF-1-R CSF1R_RAT Csfmr M-CSF-R | Proto-oncogene c-Fms
Type:
Enzyme Catalytic Domain
Mol. Mass.:
109259.61
Organism:
Rattus norvegicus (Rat)
Description:
Q00495
Residue:
978
  
Inhibitor
Name:
BDBM276743
Synonyms:
US10071991, Compound (P) US11214566, Compound (P) | US9611259, Compound (P)
Type:
Small organic molecule
Emp. Form.:
C27H35N5O2
Mol. Mass.:
461.5991
SMILES:
CC1(C)CCC(=CC1)c1nc(ccc1NC(=O)c1nc(c[nH]1)C#N)C1CC(C)(C)OC(C)(C)C1
: