Target
Activin receptor type-1B
Ligand
BDBM108945
Substrate
Meas. Tech.
Enzyme Assay
IC50
3239±n/a nM
Citation
 Alimardanov, ACuny, GDGrewal, GSLee, AMcKew, JCMohedas, AHShen, MXu, XYu, PB BMP inhibitors and methods of use thereof US Patent  US10017516 Publication Date 7/10/2018 
Target
Name:
Activin receptor type-1B
Synonyms:
ACV1B_HUMAN ACVRLK4 Activin receptor type-1B/Activin receptor-like kinase 4 (ALK-4)
Type:
PROTEIN
Mol. Mass.:
56810.99
Organism:
Homo sapiens (Human)
Description:
ChEMBL_587064
Residue:
505
  
Inhibitor
Name:
BDBM108945
Synonyms:
US10017516, Compound 48 | US9682983, 48
Type:
Small organic molecule
Emp. Form.:
C26H23N5
Mol. Mass.:
405.4943
SMILES:
C1CC(CCN1)c1ccc(cc1)-c1cnc2c(cnn2c1)-c1ccnc2ccccc12
: