Target
TGF-beta receptor type-1
Ligand
BDBM108945
Substrate
Meas. Tech.
Enzyme Assay
IC50
11580±n/a nM
Citation
 Alimardanov, ACuny, GDGrewal, GSLee, AMcKew, JCMohedas, AHShen, MXu, XYu, PB BMP inhibitors and methods of use thereof US Patent  US10017516 Publication Date 7/10/2018 
Target
Name:
TGF-beta receptor type-1
Synonyms:
ALK-5 Activin A receptor type II-like protein kinase of 53kD SKR4 TGF-beta receptor type I TGFBR1 TGFR1_HUMAN Transforming growth factor-beta receptor type I
Type:
enzyme
Mol. Mass.:
55968.24
Organism:
Homo sapiens (Human)
Description:
P36897
Residue:
503
  
Inhibitor
Name:
BDBM108945
Synonyms:
US10017516, Compound 48 | US9682983, 48
Type:
Small organic molecule
Emp. Form.:
C26H23N5
Mol. Mass.:
405.4943
SMILES:
C1CC(CCN1)c1ccc(cc1)-c1cnc2c(cnn2c1)-c1ccnc2ccccc12
: