Target
Activin receptor type-1
Ligand
BDBM143311
Substrate
Meas. Tech.
Enzyme Assay
IC50
7.70±n/a nM
Citation
 Alimardanov, ACuny, GDGrewal, GSLee, AMcKew, JCMohedas, AHShen, MXu, XYu, PB BMP inhibitors and methods of use thereof US Patent  US10017516 Publication Date 7/10/2018 
Target
Name:
Activin receptor type-1
Synonyms:
2.7.11.30 ACVR1 ACVRLK2 ALK2/ACVR1 Activin receptor-like kinase 2 Activin receptor-like kinase 2 (ALK2/ACVR1) SKR1 TGF-B superfamily receptor type I | TSR-I
Type:
Mol. Mass.:
57158.32
Organism:
Homo sapiens (Human)
Description:
Residue:
509
  
Inhibitor
Name:
BDBM143311
Synonyms:
US10017516, Compound 11 | US9682983, 11
Type:
Small organic molecule
Emp. Form.:
C28H28N6
Mol. Mass.:
448.5621
SMILES:
C[C@H]1CNC[C@@H](C)N1c1ccc(cc1)-c1cnc2c(cnn2c1)-c1cc(C)nc2ccccc12
: