Target
ATP-sensitive inward rectifier potassium channel 1
Ligand
BDBM82071
Substrate
Ki
1000±n/a nM
Comments
PDSP_1947
Citation
 Bymaster, FPDreshfield-Ahmad, LJThrelkeld, PGShaw, JLThompson, LNelson, DLHemrick-Luecke, SKWong, DT Comparative affinity of duloxetine and venlafaxine for serotonin and norepinephrine transporters in vitro and in vivo, human serotonin receptor subtypes, and other neuronal receptors. Neuropsychopharmacology 25:871-80 (2001)  
Target
Name:
ATP-sensitive inward rectifier potassium channel 1
Synonyms:
ATP-regulated potassium channel ROM-K Inward rectifier K(+) channel Kir1.1 KCNJ1_RAT Potassium channel (ATP modulatory) Renal Outer Medullary Potassium (ROMK) Romk1 | The Renal Outer Medullary Potassium (ROMK) channel (Kir1.1)
Type:
Enzyme
Mol. Mass.:
44976.27
Organism:
Rattus norvegicus (Rat)
Description:
P35560
Residue:
391
  
Inhibitor
Name:
BDBM82071
Synonyms:
CAS_93413-69-5 NSC_62923 Venlafaxine hydrochloride WY-45655
Type:
Small organic molecule
Emp. Form.:
C17H27NO2
Mol. Mass.:
277.4018
SMILES:
COc1ccc(cc1)C(CN(C)C)C1(O)CCCCC1
: