Target
Histamine H1 receptor
Ligand
BDBM22875
Substrate
Ki
1±n/a nM
Comments
PDSP_2093
Citation
 Gillard, MVan Der Perren, CMoguilevsky, NMassingham, RChatelain, P Binding characteristics of cetirizine and levocetirizine to human H(1) histamine receptors: contribution of Lys(191) and Thr(194). Mol Pharmacol 61:391-9 (2002)  
Target
Name:
Histamine H1 receptor
Synonyms:
H1R HISTAMINE H1 HRH1_HUMAN
Type:
G Protein-Coupled Receptor (GPCR)
Mol. Mass.:
55808.72
Organism:
Homo sapiens (Human)
Description:
Cell pellets from SK-N-MC cells transfected with human H1 receptor were used in binding assay.
Residue:
487
  
Inhibitor
Name:
BDBM22875
Synonyms:
2-(2-{4-[(4-chlorophenyl)(phenyl)methyl]piperazin-1-yl}ethoxy)ethan-1-ol CHEMBL896 Hydroxyzine Hydroxyzine, (R) Vistaril | med.21724, Compound 187
Type:
Small organic molecule
Emp. Form.:
C21H27ClN2O2
Mol. Mass.:
374.904
SMILES:
OCCOCCN1CCN(CC1)C(c1ccccc1)c1ccc(Cl)cc1
: