Target
Inhibitor of nuclear factor kappa-B kinase subunit epsilon
Ligand
BDBM276823
Substrate
Meas. Tech.
Biological Assay for TBK1 and IKKs
pH
7±n/a
IC50
1.41±n/a nM
Comments
extracted
Citation
 Du, ZGuerrero, JAKaplan, JAKnox, Jr., JENaduthambi, DPhillips, BWVenkataramani, CWang, PWatkins, WJZablocki, J Tank-binding kinase inhibitor compounds US Patent  US10072001 Publication Date 9/11/2018 
Target
Name:
Inhibitor of nuclear factor kappa-B kinase subunit epsilon
Synonyms:
I kappa-B kinase epsilon I-kappa-B kinase epsilon (IKK-E) IKBKE IKK-epsilon IKKE IKKI KIAA0151 | von Hippel-Lindau disease tumor suppressor/Inhibitor of nuclear factor kappa-B kinase subunit epsilon
Type:
Serine/threonine-protein kinase
Mol. Mass.:
80475.98
Organism:
Homo sapiens (Human)
Description:
Kinase inhibitory activity was determined using recombinant human IKK-epsilon expressed in baculovirus as a FLAG-tagged fusion protein.
Residue:
716
  
Inhibitor
Name:
BDBM276823
Synonyms:
US10072001, Example 9 | US10259811, Example 9
Type:
Small organic molecule
Emp. Form.:
C25H24N6O2
Mol. Mass.:
440.4971
SMILES:
N#Cc1cc(ccc1OC1CCOCC1)-c1ccnc2[nH]c(cc12)-c1cnn(c1)C1CNC1
: