Target
Serine/threonine-protein kinase TBK1
Ligand
BDBM276899
Substrate
Meas. Tech.
Biological Assay for TBK1 and IKKs
pH
7±n/a
IC50
1.31±n/a nM
Comments
extracted
Citation
 Du, ZGuerrero, JAKaplan, JAKnox, Jr., JENaduthambi, DPhillips, BWVenkataramani, CWang, PWatkins, WJZablocki, J Tank-binding kinase inhibitor compounds US Patent  US10072001 Publication Date 9/11/2018 
Target
Name:
Serine/threonine-protein kinase TBK1
Synonyms:
NAK Protein cereblon/Serine/threonine-protein kinase TBK1 TANK-binding kinase 1 (TBK-1) TBK1 | TBK1_HUMAN
Type:
protein
Mol. Mass.:
83645.20
Organism:
Homo sapiens (Human)
Description:
Q9UHD2
Residue:
729
  
Inhibitor
Name:
BDBM276899
Synonyms:
US10072001, Example 85 | US10259811, Example 85
Type:
Small organic molecule
Emp. Form.:
C32H33N5O3
Mol. Mass.:
535.6361
SMILES:
N#Cc1cc(ccc1OC1CCOCC1)-c1ccnc2[nH]c(cc12)-c1ccc(cc1)N1CCN(CC1)C1COC1
: