Target
Serine/threonine-protein kinase TBK1
Ligand
BDBM276969
Substrate
Meas. Tech.
Biological Assay for TBK1 and IKKs
pH
7±n/a
IC50
1.05±n/a nM
Comments
extracted
Citation
 Du, ZGuerrero, JAKaplan, JAKnox, Jr., JENaduthambi, DPhillips, BWVenkataramani, CWang, PWatkins, WJZablocki, J Tank-binding kinase inhibitor compounds US Patent  US10072001 Publication Date 9/11/2018 
Target
Name:
Serine/threonine-protein kinase TBK1
Synonyms:
NAK Protein cereblon/Serine/threonine-protein kinase TBK1 TANK-binding kinase 1 (TBK-1) TBK1 | TBK1_HUMAN
Type:
protein
Mol. Mass.:
83645.20
Organism:
Homo sapiens (Human)
Description:
Q9UHD2
Residue:
729
  
Inhibitor
Name:
BDBM276969
Synonyms:
US10072001, Example 145 | US10259811, Example 145
Type:
Small organic molecule
Emp. Form.:
C34H36FN7O5
Mol. Mass.:
641.6919
SMILES:
COc1cc(ccc1N1CCN(CC1)C1COC1)-c1cc2c(ncnc2[nH]1)-c1ccc(O[C@H]2CCN(C[C@H]2F)C(=O)CO)c(c1)C#N
: