Target
Serine/threonine-protein kinase TBK1
Ligand
BDBM276984
Substrate
Meas. Tech.
Biological Assay for TBK1 and IKKs
pH
7±n/a
IC50
1.32±n/a nM
Comments
extracted
Citation
 Du, ZGuerrero, JAKaplan, JAKnox, Jr., JENaduthambi, DPhillips, BWVenkataramani, CWang, PWatkins, WJZablocki, J Tank-binding kinase inhibitor compounds US Patent  US10072001 Publication Date 9/11/2018 
Target
Name:
Serine/threonine-protein kinase TBK1
Synonyms:
NAK Protein cereblon/Serine/threonine-protein kinase TBK1 TANK-binding kinase 1 (TBK-1) TBK1 | TBK1_HUMAN
Type:
protein
Mol. Mass.:
83645.20
Organism:
Homo sapiens (Human)
Description:
Q9UHD2
Residue:
729
  
Inhibitor
Name:
BDBM276984
Synonyms:
US10072001, Example 160 | US10259811, Example 160
Type:
Small organic molecule
Emp. Form.:
C31H30N6O5
Mol. Mass.:
566.6071
SMILES:
OCC(=O)N1CCC(CC1)Oc1ccc(cc1C#N)-c1ncnc2[nH]c(cc12)-c1ccc(cc1)C(=O)N1CCOCC1
: