Target
Inhibitor of nuclear factor kappa-B kinase subunit epsilon
Ligand
BDBM277059
Substrate
Meas. Tech.
Biological Assay for TBK1 and IKKs
pH
7±n/a
IC50
0.815±n/a nM
Comments
extracted
Citation
 Du, ZGuerrero, JAKaplan, JAKnox, Jr., JENaduthambi, DPhillips, BWVenkataramani, CWang, PWatkins, WJZablocki, J Tank-binding kinase inhibitor compounds US Patent  US10072001 Publication Date 9/11/2018 
Target
Name:
Inhibitor of nuclear factor kappa-B kinase subunit epsilon
Synonyms:
I kappa-B kinase epsilon I-kappa-B kinase epsilon (IKK-E) IKBKE IKK-epsilon IKKE IKKI KIAA0151 | von Hippel-Lindau disease tumor suppressor/Inhibitor of nuclear factor kappa-B kinase subunit epsilon
Type:
Serine/threonine-protein kinase
Mol. Mass.:
80475.98
Organism:
Homo sapiens (Human)
Description:
Kinase inhibitory activity was determined using recombinant human IKK-epsilon expressed in baculovirus as a FLAG-tagged fusion protein.
Residue:
716
  
Inhibitor
Name:
BDBM277059
Synonyms:
US10072001, Example 251 | US10259811, Example 251
Type:
Small organic molecule
Emp. Form.:
C30H32N8O3
Mol. Mass.:
552.6269
SMILES:
CN1CCN(CC1)c1ccc(cc1)-c1nc2c(ncnc2[nH]1)-c1ccc(OC2CCN(CC2)C(=O)CO)c(c1)C#N
: