Target
Transthyretin
Ligand
BDBM249563
Substrate
Meas. Tech.
Scintillation Proximity RBP4 Binding Assay
pH
7.4±n/a
Temperature
298.15±n/a K
IC50
25.8±n/a nM
Comments
extracted
Citation
 Petrukhin, KCioffi, CJohnson, GAllikmets, RFreeman, EChen, PConlon, MZhu, L Substituted 4-phenylpiperidines, their preparation and use US Patent  US10072016 Publication Date 9/11/2018 
Target
Name:
Transthyretin
Synonyms:
ATTR Prealbumin TTHY_HUMAN Transthyretin (TTR)
Type:
Enzyme
Mol. Mass.:
15884.31
Organism:
Homo sapiens (Human)
Description:
P02766
Residue:
147
  
Inhibitor
Name:
BDBM249563
Synonyms:
US10072016, Compound 161 US10913746, Compound 161 US9434727, 161 | US9777010, Compound 161
Type:
Small organic molecule
Emp. Form.:
C20H15ClF3N5O
Mol. Mass.:
433.814
SMILES:
FC(F)(F)c1ccc(Cl)cc1C1CCN(CC1)C(=O)c1nnc2ccc(cn12)C#N
: