Target
Ubiquitin carboxyl-terminal hydrolase 30
Ligand
BDBM404355
Substrate
Meas. Tech.
Biochemical Fluorescence Intensity Assay
IC50
<100±n/a nM
Citation
 Jones, AKemp, MStockley, MGibson, KWhitlock, G 1-cyano-pyrrolidine compounds as USP30 inhibitors US Patent  US10343992 Publication Date 7/9/2019 
Target
Name:
Ubiquitin carboxyl-terminal hydrolase 30
Synonyms:
Deubiquitinating enzyme 30 USP30 Ubiquitin carboxyl-terminal hydrolase 30 (USP30) Ubiquitin-specific-processing protease 30
Type:
Protein
Mol. Mass.:
58522.90
Organism:
Homo sapiens (Human)
Description:
Q70CQ3
Residue:
517
  
Inhibitor
Name:
BDBM404355
Synonyms:
N-(1-cyanopyrrolidin-3-yl)-2'- methoxy-[1,1'-biphenyl]-4- carboxamide US10689345, Example 14 | US11066365, Example 14
Type:
Small organic molecule
Emp. Form.:
C19H19N3O2
Mol. Mass.:
321.3731
SMILES:
COc1ccccc1-c1ccc(cc1)C(=O)NC1CCN(C1)C#N
: