Target
Neuronal acetylcholine receptor subunit alpha-4
Ligand
BDBM85207
Substrate
Ki
13±n/a nM
Comments
PDSP_1773
Citation
 Eaton, JBPeng, JHSchroeder, KMGeorge, AAFryer, JDKrishnan, CBuhlman, LKuo, YPSteinlein, OLukas, RJ Characterization of human alpha 4 beta 2-nicotinic acetylcholine receptors stably and heterologously expressed in native nicotinic receptor-null SH-EP1 human epithelial cells. Mol Pharmacol 64:1283-94 (2003)  
Target
Name:
Neuronal acetylcholine receptor subunit alpha-4
Synonyms:
ACHA4_HUMAN CHRNA4 protein Neuronal acetylcholine receptor protein alpha-4 subunit Nicotinic acetylcholine receptor alpha4/beta2/alpha5
Type:
Mol. Mass.:
69963.49
Organism:
Homo sapiens (Human)
Description:
NACHRA4
Residue:
627
  
Inhibitor
Name:
BDBM85207
Synonyms:
CAS_123990 Suberyldicholine
Type:
Small organic molecule
Emp. Form.:
C18H38N2O4
Mol. Mass.:
346.5042
SMILES:
C[N+](C)(C)CCOC(=O)CCCCCCC(=O)OCC[N+](C)(C)C
: