Target
5-hydroxytryptamine receptor 2C
Ligand
BDBM86496
Substrate
Ki
2.9±n/a nM
Comments
PDSP_3717
Citation
 Vanover, KEHarvey, SCSon, TBradley, SRKold, HMakhay, MVeinbergs, ISpalding, TAWeiner, DMAndersson, CMTolf, BRBrann, MRHacksell, UDavis, RE Pharmacological characterization of AC-90179 [2-(4-methoxyphenyl)-N-(4-methyl-benzyl)-N-(1-methyl-piperidin-4-yl)-acetamide hydrochloride]: a selective serotonin 2A receptor inverse agonist. J Pharmacol Exp Ther 310:943-51 (2004)  
Target
Name:
5-hydroxytryptamine receptor 2C
Synonyms:
5-HT-1C 5-HT1C 5-HT2C-INI 5-HTR2C 5-hydroxytryptamine receptor 2C (5-HT-2C) 5HT-1C HTR1C Serotonin (5-HT3) receptor Serotonin Receptor 2C
Type:
G Protein-Coupled Receptor (GPCR)
Mol. Mass.:
51836.79
Organism:
Homo sapiens (Human)
Description:
P28335
Residue:
458
  
Inhibitor
Name:
BDBM86496
Synonyms:
AC-90179 | N-(4-Methylbenzyl)-N-(1-methyl-4-piperidinyl)-4-methoxybenzeneacetamide
Type:
Small organic molecule
Emp. Form.:
C23H30N2O2
Mol. Mass.:
366.4965
SMILES:
COc1ccc(CC(=O)N(Cc2ccc(C)cc2)C2CCN(C)CC2)cc1
: